Target
Adenosine receptor A1
Ligand
BDBM50453220
Substrate
Meas. Tech.
ChEBML_28837
Ki
3.4±n/a nM
Citation
 Abiru, TMiyashita, TWatanabe, YYamaguchi, TMachida, HMatsuda, A Nucleosides and nucleotides. 107. 2-(cycloalkylalkynyl)adenosines: adenosine A2 receptor agonists with potent antihypertensive effects. J Med Chem 35:2253-60 (1992)  
Target
Name:
Adenosine receptor A1
Synonyms:
AA1R_RAT ADENOSINE A1 high Adenosine A1 receptor (A1) Adenosine receptors A1 | Adora1
Type:
Protein
Mol. Mass.:
36704.13
Organism:
Rattus norvegicus (rat)
Description:
Residue:
326
  
Inhibitor
Name:
BDBM50453220
Synonyms:
CHEMBL2092941
Type:
Small organic molecule
Emp. Form.:
C19H19N5O5
Mol. Mass.:
397.3847
SMILES:
Nc1nc(nc2n(cnc12)[C@@H]1O[C@H](CO)[C@@H](O)[C@H]1O)C#CC(O)c1ccccc1
: