Target
Adenosine receptor A1
Ligand
BDBM35804
Substrate
Meas. Tech.
ChEBML_28837
Ki
1232±n/a nM
Citation
 Abiru, TMiyashita, TWatanabe, YYamaguchi, TMachida, HMatsuda, A Nucleosides and nucleotides. 107. 2-(cycloalkylalkynyl)adenosines: adenosine A2 receptor agonists with potent antihypertensive effects. J Med Chem 35:2253-60 (1992)  
Target
Name:
Adenosine receptor A1
Synonyms:
AA1R_RAT ADENOSINE A1 high Adenosine A1 receptor (A1) Adenosine receptors A1 | Adora1
Type:
Protein
Mol. Mass.:
36704.13
Organism:
Rattus norvegicus (rat)
Description:
Residue:
326
  
Inhibitor
Name:
BDBM35804
Synonyms:
(CGS21680) 3-(4-{2-[6-Amino-9-(5-ethylcarbamoylmethyl-3,4-dihydroxy-tetrahydro-furan-2-yl)-9H-purin-2-ylamino]-ethyl}-phenyl)-propionic acid 2-[4-(2-carboxyethyl)phenethylamino]-5''''-N-ethylcarboxamidoadenosine 3-(4-(2-(6-amino-9-((2R,3R,4S,5S)-5-(ethylcarbamoyl)-3,4-dihydroxy-tetrahydrofuran-2-yl)-9H-purin-2-ylamino)ethyl)phenyl)propanoic acid 3-(4-{2-[6-Amino-9-((2R,3R,4S,5S)-5-ethylcarbamoyl-3,4-dihydroxy-tetrahydro-furan-2-yl)-9H-purin-2-ylamino]-ethyl}-phenyl)-propionic acid CGS-21680 [3H]-CGS 21680
Type:
radiolabeled ligand
Emp. Form.:
C23H29N7O6
Mol. Mass.:
499.5197
SMILES:
CCNC(=O)[C@H]1O[C@H]([C@H](O)[C@@H]1O)n1cnc2c(N)nc(NCCc3ccc(CCC(O)=O)cc3)nc12
: