Target
D(2) dopamine receptor
Ligand
BDBM50005120
Substrate
Meas. Tech.
ChEMBL_62407 (CHEMBL675732)
Ki
0.120000±n/a nM
Citation
 Pettersson, ILiljefors, T Conformational analysis of dopamine D-2 receptor antagonists of the benzamide series in relation to a recently proposed D-2 receptor-interaction model. J Med Chem 35:2355-63 (1992)  
Target
Name:
D(2) dopamine receptor
Synonyms:
DOPAMINE D2 DOPAMINE D2 Short Dopamine D2 receptor Drd2
Type:
G Protein-Coupled Receptor (GPCR)
Mol. Mass.:
50931.60
Organism:
Rattus norvegicus (rat)
Description:
P61169
Residue:
444
  
Inhibitor
Name:
BDBM50005120
Synonyms:
CHEMBL274491 N-(1-Benzyl-2-methyl-pyrrolidin-3-yl)-5-chloro-2-methoxy-4-methylamino-benzamide YM-09151-2
Type:
Small organic molecule
Emp. Form.:
C21H26ClN3O2
Mol. Mass.:
387.903
SMILES:
CNc1cc(OC)c(cc1Cl)C(=O)N[C@H]1CCN(Cc2ccccc2)[C@H]1C
: