Target
D(2) dopamine receptor
Ligand
BDBM81774
Substrate
Meas. Tech.
ChEMBL_61744 (CHEMBL676051)
IC50
233±n/a nM
Citation
 Pettersson, ILiljefors, T Conformational analysis of dopamine D-2 receptor antagonists of the benzamide series in relation to a recently proposed D-2 receptor-interaction model. J Med Chem 35:2355-63 (1992)  
Target
Name:
D(2) dopamine receptor
Synonyms:
DOPAMINE D2 DOPAMINE D2 Short Dopamine D2 receptor Drd2
Type:
G Protein-Coupled Receptor (GPCR)
Mol. Mass.:
50931.60
Organism:
Rattus norvegicus (rat)
Description:
P61169
Residue:
444
  
Inhibitor
Name:
BDBM81774
Synonyms:
CAS_15676-16-1 Sulpiride-S | Sulpiride-l
Type:
Emp. Form.:
C15H23N3O4S
Mol. Mass.:
341.426
SMILES:
CCN1CCC[C@H]1CNC(=O)c1cc(ccc1OC)S(N)(=O)=O
: