Target
Adenosine receptor A1
Ligand
BDBM50368347
Substrate
Meas. Tech.
ChEMBL_28545 (CHEMBL640324)
IC50
13090±n/a nM
Citation
 Cristalli, GEleuteri, AVittori, SVolpini, RLohse, MJKlotz, KN 2-Alkynyl derivatives of adenosine and adenosine-5'-N-ethyluronamide as selective agonists at A2 adenosine receptors. J Med Chem 35:2363-8 (1992)  
Target
Name:
Adenosine receptor A1
Synonyms:
AA1R_RAT ADENOSINE A1 high Adenosine A1 receptor (A1) Adenosine receptors A1 | Adora1
Type:
Protein
Mol. Mass.:
36704.13
Organism:
Rattus norvegicus (rat)
Description:
Residue:
326
  
Inhibitor
Name:
BDBM50368347
Synonyms:
CHEMBL610655
Type:
Small organic molecule
Emp. Form.:
C19H26N6O4
Mol. Mass.:
402.4475
SMILES:
CCCCCC#Cc1nc(N)c2ncn(C3O[C@@H]([C@@H](O)[C@H]3O)C(=O)NCC)c2n1
: