Target
Adenosine receptor A1
Ligand
BDBM50368346
Substrate
Meas. Tech.
ChEMBL_29159 (CHEMBL637708)
Ki
2940±n/a nM
Citation
 Cristalli, GEleuteri, AVittori, SVolpini, RLohse, MJKlotz, KN 2-Alkynyl derivatives of adenosine and adenosine-5'-N-ethyluronamide as selective agonists at A2 adenosine receptors. J Med Chem 35:2363-8 (1992)  
Target
Name:
Adenosine receptor A1
Synonyms:
AA1R_RAT ADENOSINE A1 high Adenosine A1 receptor (A1) Adenosine receptors A1 | Adora1
Type:
Protein
Mol. Mass.:
36704.13
Organism:
Rattus norvegicus (rat)
Description:
Residue:
326
  
Inhibitor
Name:
BDBM50368346
Synonyms:
CHEMBL608008
Type:
Small organic molecule
Emp. Form.:
C20H28N6O4
Mol. Mass.:
416.4741
SMILES:
CCCCCCC#Cc1nc(N)c2ncn(C3O[C@@H]([C@@H](O)[C@H]3O)C(=O)NCC)c2n1
: