Target
Mu-type opioid receptor
Ligand
BDBM50000795
Substrate
Meas. Tech.
ChEBML_146239
IC50
4.2±n/a nM
Citation
 Dasher, WEKlein, PNelson, WL Electrophilic opioid ligands. Oxygen tethered alpha-methylene-gamma-lactone, acrylate, isothiocyanate, and epoxide derivatives of 6 beta-naltrexol. J Med Chem 35:2374-84 (1992)  
Target
Name:
Mu-type opioid receptor
Synonyms:
M-OR-1 Mu opioid receptor OPIATE Mu OPRM_CAVPO
Type:
Enzyme Catalytic Domain
Mol. Mass.:
11165.58
Organism:
GUINEA PIG
Description:
P97266
Residue:
98
  
Inhibitor
Name:
BDBM50000795
Synonyms:
5-[4-cyclopropylmethyl-10,17-dihydroxy-12-oxa-4-azapentacyclo[9.6.1.01,13.05,17.07,18]octadeca-7(18),8,10-trien-14-yloxymethyl]-3-methylenetetrahydro-2-furanone | CHEMBL78796
Type:
Small organic molecule
Emp. Form.:
C26H31NO6
Mol. Mass.:
453.5274
SMILES:
Oc1ccc2C[C@H]3N(CC4CC4)CC[C@@]45[C@@H](Oc1c24)[C@@H](CC[C@@]35O)OC[C@H]1CC(=C)C(=O)O1
: