Target
Delta-type/Kappa-type/Mu-type opioid receptor
Ligand
BDBM50000788
Substrate
Meas. Tech.
ChEMBL_145870 (CHEMBL754075)
IC50
43±n/a nM
Citation
 Dasher, WEKlein, PNelson, WL Electrophilic opioid ligands. Oxygen tethered alpha-methylene-gamma-lactone, acrylate, isothiocyanate, and epoxide derivatives of 6 beta-naltrexol. J Med Chem 35:2374-84 (1992)  
Target
Name:
Delta-type/Kappa-type/Mu-type opioid receptor
Synonyms:
Opioid receptors; mu/kappa/delta
Type:
Mol. Mass.:
Description:
ASSAY_ID of ChEMBL is 357797
Components:
This complex has 3 components.
Component 1
Name:
Mu-type opioid receptor
Synonyms:
M-OR-1 MOR-1 MUOR1 Mu opiate receptor OPRM1 hMOP | mu-type opioid receptor isoform MOR-1
Type:
G Protein-Coupled Receptor (GPCR)
Mol. Mass.:
44789.51
Organism:
Homo sapiens (Human)
Description:
P35372
Residue:
400
  
Component 2
Name:
Kappa-type opioid receptor
Synonyms:
K-OR-1 Kappa-opioid receptor (KOR) Kappa-type opioid receptor (KOR) OPIATE Kappa OPRK1 kappa opioid receptor (KOR)
Type:
G Protein-Coupled Receptor (GPCR)
Mol. Mass.:
42648.76
Organism:
Homo sapiens (Human)
Description:
P41145
Residue:
380
  
Component 3
Name:
Delta-type opioid receptor
Synonyms:
D-OR-1 Delta opioid receptor OPIATE Delta OPRD1 OPRK1 | opioid receptor, delta 1
Type:
G Protein-Coupled Receptor (GPCR)
Mol. Mass.:
40382.98
Organism:
Homo sapiens (Human)
Description:
Competition binding assays were carried out using membrane preparations from transfected HN9.10 cells that constitutively expressed the delta opioid receptor.
Residue:
372
  
Inhibitor
Name:
BDBM50000788
Synonyms:
(morphine)4-methyl-(1S,5R,13R,14S,17R)-12-oxa-4-azapentacyclo[9.6.1.01,13.05,17.07,18]octadeca-7(18),8,10,15-tetraene-10,14-diol (naloxone)4-allyl-10,17-dihydroxy-(1S,5R,13R,17S)-12-oxa-4-azapentacyclo[9.6.1.01,13.05,17.07,18]octadeca-7(18),8,10-trien-14-one 4-allyl-10,17-dihydroxy-(1S,5R,13R,17S)-12-oxa-4-azapentacyclo[9.6.1.01,13.05,17.07,18]octadeca-7(18),8,10-trien-14-one 4-allyl-10,17-dihydroxy-(1S,5R,13R,17S)-12-oxa-4-azapentacyclo[9.6.1.01,13.05,17.07,18]octadeca-7(18),8,10-trien-14-one( Naloxone) 4-allyl-10,17-dihydroxy-12-oxa-4-azapentacyclo[9.6.1.01,13.05,17.07,18]octadeca-7(18),8,10-trien-14-one Analog of 14-(Arylhydroxyamino)codeinone NARCAN [17-(2,3-3H-2-propenyl)]-4, 5a -epoxy-3,14-dihydroxymorphinan-6-one
Type:
Small organic molecule
Emp. Form.:
C19H21NO4
Mol. Mass.:
327.3743
SMILES:
Oc1ccc2C[C@H]3N(CC=C)CC[C@@]45[C@@H](Oc1c24)C(=O)CC[C@@]35O
: