Target
Voltage-dependent L-type calcium channel subunit alpha-1C
Ligand
BDBM50336640
Substrate
Meas. Tech.
ChEBML_164619
IC50
2.9±n/a nM
Citation
 Sunkel, CEFau de Casa-Juana, MSantos, LGarcía, AGArtalejo, CRVillarroya, MGonzález-Morales, MALópez, MGCillero, JAlonso, S Synthesis of 3-[(2,3-dihydro-1,1,3-trioxo-1,2-benzisothiazol-2-yl)alkyl] 1,4-dihydropyridine-3,5-dicarboxylate derivatives as calcium channel modulators. J Med Chem 35:2407-14 (1992)  
Target
Name:
Voltage-dependent L-type calcium channel subunit alpha-1C
Synonyms:
CAC1C_RABIT CACN2 CACNL1A1 L-type calcium channel alpha 1C/beta 2A | Voltage-gated L-type calcium channel alpha-1C subunit
Type:
PROTEIN
Mol. Mass.:
242793.78
Organism:
Oryctolagus cuniculus
Description:
ChEMBL_42776
Residue:
2171
  
Inhibitor
Name:
BDBM50336640
Synonyms:
(nifedipine) 2,6-Dimethyl-4-(2-nitro-phenyl)-1,4-dihydro-pyridine-3,5-dicarboxylic acid dimethyl ester Adalat Afeditab cr NIFEDIPINE Procardia dimethyl 2,6-dimethyl-4-(2-nitrophenyl)-1,4-dihydropyridine-3,5-dicarboxylate
Type:
Small organic molecule
Emp. Form.:
C17H18N2O6
Mol. Mass.:
346.3346
SMILES:
COC(=O)C1C(C(C(=O)OC)=C(C)N=C1C)c1ccccc1[N+]([O-])=O
: