Target
Voltage-dependent L-type calcium channel subunit alpha-1C
Ligand
BDBM50002628
Substrate
Meas. Tech.
ChEBML_164619
IC50
2.9±n/a nM
Citation
 Sunkel, CEFau de Casa-Juana, MSantos, LGarcía, AGArtalejo, CRVillarroya, MGonzález-Morales, MALópez, MGCillero, JAlonso, S Synthesis of 3-[(2,3-dihydro-1,1,3-trioxo-1,2-benzisothiazol-2-yl)alkyl] 1,4-dihydropyridine-3,5-dicarboxylate derivatives as calcium channel modulators. J Med Chem 35:2407-14 (1992)  
Target
Name:
Voltage-dependent L-type calcium channel subunit alpha-1C
Synonyms:
CAC1C_RABIT CACN2 CACNL1A1 L-type calcium channel alpha 1C/beta 2A | Voltage-gated L-type calcium channel alpha-1C subunit
Type:
PROTEIN
Mol. Mass.:
242793.78
Organism:
Oryctolagus cuniculus
Description:
ChEMBL_42776
Residue:
2171
  
Inhibitor
Name:
BDBM50002628
Synonyms:
4-(2,3-Dichloro-phenyl)-2,6-dimethyl-1,4-dihydro-pyridine-3,5-dicarboxylic acid 3-(2-methoxy-ethyl) ester 5-(1,1,3-trioxo-1,3-dihydro-1lambda*6*-benzo[d]isothiazol-2-ylmethyl) ester | CHEMBL78651
Type:
Small organic molecule
Emp. Form.:
C26H24Cl2N2O8S
Mol. Mass.:
595.448
SMILES:
COCCOC(=O)C1C(C(C(=O)OCN2C(=O)c3ccccc3S2(=O)=O)=C(C)N=C1C)c1cccc(Cl)c1Cl
: