Target
Sodium-dependent serotonin transporter
Ligand
BDBM50006776
Substrate
Meas. Tech.
ChEBML_201636
IC50
374±n/a nM
Citation
 Carroll, FIAbraham, PLewin, AHParham, KABoja, JWKuhar, M Isopropyl and phenyl esters of 3 beta-(4-substituted phenyl)tropan-2 beta-carboxylic acids. Potent and selective compounds for the dopamine transporter. J Med Chem 35:2497-500 (1992)  
Target
Name:
Sodium-dependent serotonin transporter
Synonyms:
5-HT Transporter 5HT transporter Anandamid membrane transporter, AMT Monoamine transporters; Norepinephrine & serotonin Slc6a4 Sodium-dependent serotonin transporter (SERT) | imipramine receptor
Type:
Multi-pass membrane protein
Mol. Mass.:
70168.43
Organism:
Rattus norvegicus (rat)
Description:
P31652
Residue:
630
  
Inhibitor
Name:
BDBM50006776
Synonyms:
3-Benzoyloxy-8-methyl-8-aza-bicyclo[3.2.1]octane-2-carboxylic acid 3-phenyl-propyl ester | CHEMBL84244
Type:
Small organic molecule
Emp. Form.:
C25H29NO4
Mol. Mass.:
407.5021
SMILES:
CN1[C@@H]2CCC1[C@H]([C@H](C2)OC(=O)c1ccccc1)C(=O)OCCCc1ccccc1
: