Target
Prostaglandin G/H synthase 1/2
Ligand
BDBM50006795
Substrate
Meas. Tech.
ChEMBL_158124 (CHEMBL762600)
IC50
44000±n/a nM
Citation
 Musser, JHKreft, AF 5-lipoxygenase: properties, pharmacology, and the quinolinyl(bridged)aryl class of inhibitors. J Med Chem 35:2501-24 (1992)  
Target
Name:
Prostaglandin G/H synthase 1/2
Synonyms:
Prostaglandin G/H synthase (cyclooxygenase)
Type:
Mol. Mass.:
Description:
ASSAY_ID of ChEMBL is 158123
Components:
This complex has 2 components.
Component 1
Name:
Prostaglandin G/H synthase 1
Synonyms:
Cox-1 Cyclooxygenase-1 PGH1_MOUSE PHS 1 Prostaglandin H2 synthase 1 Ptgs1
Type:
PROTEIN
Mol. Mass.:
69044.61
Organism:
Mus musculus
Description:
ChEMBL_10575
Residue:
602
  
Component 2
Name:
Prostaglandin G/H synthase 2
Synonyms:
Cox-2 Cyclooxygenase-2 Glucocorticoid-regulated inflammatory cyclooxygenase Macrophage activation-associated marker protein P71/73 PGH synthase 2 PGHS-2 Pghs-b Prostaglandin H2 synthase 2 Ptgs2 Tis10
Type:
Protein
Mol. Mass.:
69020.39
Organism:
Mus musculus (Mouse)
Description:
Q05769
Residue:
604
  
Inhibitor
Name:
BDBM50006795
Synonyms:
2-(Naphthalen-1-yloxymethyl)-quinoline WY-47288
Type:
Small organic molecule
Emp. Form.:
C20H15NO
Mol. Mass.:
285.3392
SMILES:
C(Oc1cccc2ccccc12)c1ccc2ccccc2n1
: