Target
Polyunsaturated fatty acid 5-lipoxygenase
Ligand
BDBM50006795
Substrate
Meas. Tech.
ChEBML_3867
IC50
200±n/a nM
Citation
 Musser, JHKreft, AF 5-lipoxygenase: properties, pharmacology, and the quinolinyl(bridged)aryl class of inhibitors. J Med Chem 35:2501-24 (1992)  
Target
Name:
Polyunsaturated fatty acid 5-lipoxygenase
Synonyms:
5-LO Alox5 LOX5_MOUSE
Type:
PROTEIN
Mol. Mass.:
77961.27
Organism:
Mus musculus
Description:
ChEMBL_675639
Residue:
674
  
Inhibitor
Name:
BDBM50006795
Synonyms:
2-(Naphthalen-1-yloxymethyl)-quinoline WY-47288
Type:
Small organic molecule
Emp. Form.:
C20H15NO
Mol. Mass.:
285.3392
SMILES:
C(Oc1cccc2ccccc12)c1ccc2ccccc2n1
: