Target
Polyunsaturated fatty acid 5-lipoxygenase
Ligand
BDBM50004679
Substrate
Meas. Tech.
ChEMBL_738 (CHEMBL615640)
IC50
19±n/a nM
Citation
 Musser, JHKreft, AF 5-lipoxygenase: properties, pharmacology, and the quinolinyl(bridged)aryl class of inhibitors. J Med Chem 35:2501-24 (1992)  
Target
Name:
Polyunsaturated fatty acid 5-lipoxygenase
Synonyms:
Alox5 LOX5_RAT
Type:
PROTEIN
Mol. Mass.:
78082.31
Organism:
Rattus norvegicus
Description:
ChEMBL_1432947
Residue:
673
  
Inhibitor
Name:
BDBM50004679
Synonyms:
2-Benzyl-naphthalen-1-ol CHEMBL85000
Type:
Small organic molecule
Emp. Form.:
C17H14O
Mol. Mass.:
234.2925
SMILES:
Oc1c(Cc2ccccc2)ccc2ccccc12
: