Target
Polyunsaturated fatty acid 5-lipoxygenase
Ligand
BDBM50006815
Substrate
Meas. Tech.
ChEMBL_4186 (CHEMBL619988)
IC50
300±n/a nM
Citation
 Musser, JHKreft, AF 5-lipoxygenase: properties, pharmacology, and the quinolinyl(bridged)aryl class of inhibitors. J Med Chem 35:2501-24 (1992)  
Target
Name:
Polyunsaturated fatty acid 5-lipoxygenase
Synonyms:
Alox5 LOX5_RAT
Type:
PROTEIN
Mol. Mass.:
78082.31
Organism:
Rattus norvegicus
Description:
ChEMBL_1432947
Residue:
673
  
Inhibitor
Name:
BDBM50006815
Synonyms:
4,6-Dimethyl-2-(6-phenyl-hexylamino)-pyrimidin-5-ol CP-70490
Type:
Small organic molecule
Emp. Form.:
C18H25N3O
Mol. Mass.:
299.4106
SMILES:
Cc1nc(NCCCCCCc2ccccc2)nc(C)c1O
: