Target
Polyunsaturated fatty acid 5-lipoxygenase
Ligand
BDBM50006821
Substrate
Meas. Tech.
ChEMBL_3981 (CHEMBL619254)
IC50
3900±n/a nM
Citation
 Musser, JHKreft, AF 5-lipoxygenase: properties, pharmacology, and the quinolinyl(bridged)aryl class of inhibitors. J Med Chem 35:2501-24 (1992)  
Target
Name:
Polyunsaturated fatty acid 5-lipoxygenase
Synonyms:
Alox5 LOX5_RAT
Type:
PROTEIN
Mol. Mass.:
78082.31
Organism:
Rattus norvegicus
Description:
ChEMBL_1432947
Residue:
673
  
Inhibitor
Name:
BDBM50006821
Synonyms:
4-Methyl-N-[3-(quinolin-2-ylmethoxy)-benzoyl]-benzenesulfonamide | CHEMBL310833
Type:
Small organic molecule
Emp. Form.:
C24H20N2O4S
Mol. Mass.:
432.492
SMILES:
Cc1ccc(cc1)S(=O)(=O)NC(=O)c1cccc(OCc2ccc3ccccc3n2)c1
: