Target
Polyunsaturated fatty acid 5-lipoxygenase
Ligand
BDBM50006820
Substrate
Meas. Tech.
ChEBML_740
IC50
6200±n/a nM
Citation
 Musser, JHKreft, AF 5-lipoxygenase: properties, pharmacology, and the quinolinyl(bridged)aryl class of inhibitors. J Med Chem 35:2501-24 (1992)  
Target
Name:
Polyunsaturated fatty acid 5-lipoxygenase
Synonyms:
Alox5 LOX5_RAT
Type:
PROTEIN
Mol. Mass.:
78082.31
Organism:
Rattus norvegicus
Description:
ChEMBL_1432947
Residue:
673
  
Inhibitor
Name:
BDBM50006820
Synonyms:
2-[3-(1H-Tetrazol-5-ylmethyl)-phenoxymethyl]-quinoline | CHEMBL81199
Type:
Small organic molecule
Emp. Form.:
C18H15N5O
Mol. Mass.:
317.3446
SMILES:
C(Oc1cccc(Cc2nnn[nH]2)c1)c1ccc2ccccc2n1
: