Target
Renin
Ligand
BDBM50006843
Substrate
Meas. Tech.
ChEBML_195741
IC50
0.581000±n/a nM
Citation
 Patt, WCHamilton, HWTaylor, MDRyan, MJTaylor, DGConnolly, CJDoherty, AMKlutchko, SRSircar, ISteinbaugh, BA Structure-activity relationships of a series of 2-amino-4-thiazole-containing renin inhibitors. J Med Chem 35:2562-72 (1992)  
Target
Name:
Renin
Synonyms:
Angiotensinogenase RENI_HUMAN
Type:
Enzyme
Mol. Mass.:
45058.99
Organism:
Homo sapiens (Human)
Description:
Residue:
406
  
Inhibitor
Name:
BDBM50006843
Synonyms:
CHEMBL314066 | N-[(2-Amino-thiazol-4-yl)-(1-cyclohexylmethyl-2,3-dihydroxy-5-methyl-hexylcarbamoyl)-methyl]-2-(morpholine-4-sulfonylamino)-3-phenyl-propionamide
Type:
Small organic molecule
Emp. Form.:
C32H50N6O7S2
Mol. Mass.:
694.905
SMILES:
CC(C)C[C@H](O)[C@H](O)[C@H](CC1CCCCC1)NC(=O)C(NC(=O)[C@H](Cc1ccccc1)NS(=O)(=O)N1CCOCC1)c1csc(N)n1
: