Target
Cathepsin D
Ligand
BDBM50006202
Substrate
Meas. Tech.
ChEMBL_44968 (CHEMBL662698)
IC50
>100000±n/a nM
Citation
 Patt, WCHamilton, HWTaylor, MDRyan, MJTaylor, DGConnolly, CJDoherty, AMKlutchko, SRSircar, ISteinbaugh, BA Structure-activity relationships of a series of 2-amino-4-thiazole-containing renin inhibitors. J Med Chem 35:2562-72 (1992)  
Target
Name:
Cathepsin D
Synonyms:
CATD_BOVIN | CTSD
Type:
PROTEIN
Mol. Mass.:
42158.92
Organism:
Bos taurus
Description:
ChEMBL_1458606
Residue:
387
  
Inhibitor
Name:
BDBM50006202
Synonyms:
3-Amino-N-[1-[1-(1-cyclohexylmethyl-2,3-dihydroxy-5-methyl-hexylcarbamoyl)-2-(1H-imidazol-4-yl)-ethylcarbamoyl]-2-(4-methoxy-phenyl)-ethyl]-3-methyl-butyramide CHEMBL300337 | ENALKIREN
Type:
Small organic molecule
Emp. Form.:
C35H56N6O6
Mol. Mass.:
656.8557
SMILES:
COc1ccc(C[C@H](NC(=O)CC(C)(C)N)C(=O)N[C@@H](Cc2cnc[nH]2)C(=O)N[C@@H](CC2CCCCC2)[C@@H](O)[C@@H](O)CC(C)C)cc1
: