Target
Renin
Ligand
BDBM50006861
Substrate
Meas. Tech.
ChEBML_195741
IC50
3.4±n/a nM
Citation
 Patt, WCHamilton, HWTaylor, MDRyan, MJTaylor, DGConnolly, CJDoherty, AMKlutchko, SRSircar, ISteinbaugh, BA Structure-activity relationships of a series of 2-amino-4-thiazole-containing renin inhibitors. J Med Chem 35:2562-72 (1992)  
Target
Name:
Renin
Synonyms:
Angiotensinogenase RENI_HUMAN
Type:
Enzyme
Mol. Mass.:
45058.99
Organism:
Homo sapiens (Human)
Description:
Residue:
406
  
Inhibitor
Name:
BDBM50006861
Synonyms:
4-{3-(2-Amino-thiazol-4-yl)-2-[2-(morpholine-4-sulfonylamino)-3-phenyl-propionylamino]-propionylamino}-5-cyclohexyl-3-hydroxy-pentanoic acid (2-morpholin-4-yl-ethyl)-amide | CHEMBL315992
Type:
Small organic molecule
Emp. Form.:
C36H56N8O8S2
Mol. Mass.:
793.009
SMILES:
Nc1nc(C[C@H](NC(=O)[C@H](Cc2ccccc2)NS(=O)(=O)N2CCOCC2)C(=O)N[C@@H](CC2CCCCC2)[C@@H](O)CC(=O)NCCN2CCOCC2)cs1
: