Target
Renin
Ligand
BDBM50006859
Substrate
Meas. Tech.
ChEBML_195741
IC50
2.7±n/a nM
Citation
 Patt, WCHamilton, HWTaylor, MDRyan, MJTaylor, DGConnolly, CJDoherty, AMKlutchko, SRSircar, ISteinbaugh, BA Structure-activity relationships of a series of 2-amino-4-thiazole-containing renin inhibitors. J Med Chem 35:2562-72 (1992)  
Target
Name:
Renin
Synonyms:
Angiotensinogenase RENI_HUMAN
Type:
Enzyme
Mol. Mass.:
45058.99
Organism:
Homo sapiens (Human)
Description:
Residue:
406
  
Inhibitor
Name:
BDBM50006859
Synonyms:
2-((R)-(S)-Morpholine-4-sulfonyl)-1,2,3,4-tetrahydro-isoquinoline-3-carboxylic acid {(S)-2-(2-amino-thiazol-4-yl)-1-[(S)-1-((S)-cyclohexylmethyl)-2,3-dihydroxy-5-methyl-hexylcarbamoyl]-ethyl}-amide CHEMBL60610
Type:
Small organic molecule
Emp. Form.:
C34H52N6O7S2
Mol. Mass.:
720.943
SMILES:
CC(C)C[C@H](O)[C@H](O)[C@H](CC1CCCCC1)NC(=O)[C@H](Cc1csc(N)n1)NC(=O)[C@@H]1Cc2ccccc2CN1S(=O)(=O)N1CCOCC1
: