Target
Cathepsin D
Ligand
BDBM50006857
Substrate
Meas. Tech.
ChEBML_44968
IC50
25000±n/a nM
Citation
 Patt, WCHamilton, HWTaylor, MDRyan, MJTaylor, DGConnolly, CJDoherty, AMKlutchko, SRSircar, ISteinbaugh, BA Structure-activity relationships of a series of 2-amino-4-thiazole-containing renin inhibitors. J Med Chem 35:2562-72 (1992)  
Target
Name:
Cathepsin D
Synonyms:
CATD_BOVIN | CTSD
Type:
PROTEIN
Mol. Mass.:
42158.92
Organism:
Bos taurus
Description:
ChEMBL_1458606
Residue:
387
  
Inhibitor
Name:
BDBM50006857
Synonyms:
4-{3-(2-Amino-thiazol-4-yl)-2-[2-(morpholine-4-sulfonylamino)-3-phenyl-propionylamino]-propionylamino}-5-cyclohexyl-3-hydroxy-pentanoic acid {2-[bis-(2-hydroxy-ethyl)-amino]-ethyl}-amide | CHEMBL316218
Type:
Small organic molecule
Emp. Form.:
C36H58N8O9S2
Mol. Mass.:
811.024
SMILES:
Nc1nc(C[C@H](NC(=O)[C@H](Cc2ccccc2)NS(=O)(=O)N2CCOCC2)C(=O)N[C@@H](CC2CCCCC2)[C@@H](O)CC(=O)NCCN(CCO)CCO)cs1
: