Target
Cholecystokinin receptor type A
Ligand
BDBM50006883
Substrate
Meas. Tech.
ChEBML_49401
IC50
1300±n/a nM
Citation
 Drysdale, MJPritchard, MCHorwell, DC Rationally designed"dipeptoid" analogues of CCK. Acid mimics of the potent and selective non-peptide CCK-B receptor antagonist CI-988. J Med Chem 35:2573-81 (1992)  
Target
Name:
Cholecystokinin receptor type A
Synonyms:
CCKAR_RAT Cholecystokinin peripheral Cholecystokinin receptor type A
Type:
Enzyme Catalytic Domain
Mol. Mass.:
49676.37
Organism:
RAT
Description:
Cholecystokinin central 0 RAT::P30551
Residue:
444
  
Inhibitor
Name:
BDBM50006883
Synonyms:
CHEMBL313499 | [1-[2-(3-Hydroxycarbamoyl-propionylamino)-2-phenyl-ethylcarbamoyl]-2-(1H-indol-3-yl)-1-methyl-ethyl]-carbamic acid adamantan-2-yl ester (1.5 hydrate)
Type:
Small organic molecule
Emp. Form.:
C35H43N5O6
Mol. Mass.:
629.7458
SMILES:
CC(Cc1c[nH]c2ccccc12)(NC(=O)OC1C2CC3CC(C2)CC1C3)C(=O)NC[C@@H](NC(=O)CCC(=O)NO)c1ccccc1
: