Target
Cholecystokinin receptor type A
Ligand
BDBM50006885
Substrate
Meas. Tech.
ChEBML_49401
IC50
1300±n/a nM
Citation
 Drysdale, MJPritchard, MCHorwell, DC Rationally designed"dipeptoid" analogues of CCK. Acid mimics of the potent and selective non-peptide CCK-B receptor antagonist CI-988. J Med Chem 35:2573-81 (1992)  
Target
Name:
Cholecystokinin receptor type A
Synonyms:
CCKAR_RAT Cholecystokinin peripheral Cholecystokinin receptor type A
Type:
Enzyme Catalytic Domain
Mol. Mass.:
49676.37
Organism:
RAT
Description:
Cholecystokinin central 0 RAT::P30551
Residue:
444
  
Inhibitor
Name:
BDBM50006885
Synonyms:
(2-(1H-Indol-3-yl)-1-methyl-1-{2-phenyl-2-[3-(5H-tetrazol-5-ylcarbamoyl)-propionylamino]-ethylcarbamoyl}-ethyl)-carbamic acid adamantan-2-yl ester (hydrate) | CHEMBL85607
Type:
Small organic molecule
Emp. Form.:
C36H43N9O5
Mol. Mass.:
681.7839
SMILES:
CC(Cc1c[nH]c2ccccc12)(NC(=O)OC1C2CC3CC(C2)CC1C3)C(=O)NC[C@@H](NC(=O)CCC(=O)Nc1nnn[nH]1)c1ccccc1
: