Target
Cholecystokinin receptor type A
Ligand
BDBM50006888
Substrate
Meas. Tech.
ChEBML_49401
IC50
4400±n/a nM
Citation
 Drysdale, MJPritchard, MCHorwell, DC Rationally designed"dipeptoid" analogues of CCK. Acid mimics of the potent and selective non-peptide CCK-B receptor antagonist CI-988. J Med Chem 35:2573-81 (1992)  
Target
Name:
Cholecystokinin receptor type A
Synonyms:
CCKAR_RAT Cholecystokinin peripheral Cholecystokinin receptor type A
Type:
Enzyme Catalytic Domain
Mol. Mass.:
49676.37
Organism:
RAT
Description:
Cholecystokinin central 0 RAT::P30551
Residue:
444
  
Inhibitor
Name:
BDBM50006888
Synonyms:
(2-{2-[2-(Adamantan-2-yloxycarbonylamino)-3-(1H-indol-3-yl)-2-methyl-propionylamino]-1-phenyl-ethylcarbamoyl}-ethyl)-methyl-phosphinic acid (1.5 hydrate) | CHEMBL433148
Type:
Small organic molecule
Emp. Form.:
C35H45N4O6P
Mol. Mass.:
648.7288
SMILES:
CC(Cc1c[nH]c2ccccc12)(NC(=O)OC1C2CC3CC(C2)CC1C3)C(=O)NC[C@@H](NC(=O)CCP(C)(O)=O)c1ccccc1
: