Target
Gastrin/cholecystokinin type B receptor
Ligand
BDBM50006872
Substrate
Meas. Tech.
ChEMBL_48250 (CHEMBL661839)
IC50
77±n/a nM
Citation
 Drysdale, MJPritchard, MCHorwell, DC Rationally designed"dipeptoid" analogues of CCK. Acid mimics of the potent and selective non-peptide CCK-B receptor antagonist CI-988. J Med Chem 35:2573-81 (1992)  
Target
Name:
Gastrin/cholecystokinin type B receptor
Synonyms:
Cckbr Cholecystokinin receptor Gastrin/cholecystokinin type B receptor
Type:
Enzyme Catalytic Domain
Mol. Mass.:
49196.59
Organism:
MOUSE
Description:
Cholecystokinin A CCKBR MOUSE::P56481
Residue:
453
  
Inhibitor
Name:
BDBM50006872
Synonyms:
CHEMBL86702 | {2-(1H-Indol-3-yl)-1-methyl-1-[2-phenyl-2-(3-trifluoromethanesulfonylamino-propionylamino)-ethylcarbamoyl]-ethyl}-carbamic acid adamantan-2-yl ester
Type:
Small organic molecule
Emp. Form.:
C35H42F3N5O6S
Mol. Mass.:
717.798
SMILES:
CC(Cc1c[nH]c2ccccc12)(NC(=O)OC1C2CC3CC(C2)CC1C3)C(=O)NC[C@@H](NC(=O)CCNS(=O)(=O)C(F)(F)F)c1ccccc1
: