Target
Polyunsaturated fatty acid 5-lipoxygenase
Ligand
BDBM50000831
Substrate
Meas. Tech.
ChEMBL_3807 (CHEMBL619882)
IC50
900±n/a nM
Citation
 Crawley, GCDowell, RIEdwards, PNFoster, SJMcMillan, RMWalker, ERWaterson, DBird, TGBruneau, PGiroaeau, JM Methoxytetrahydropyrans. A new series of selective and orally potent 5-lipoxygenase inhibitors. J Med Chem 35:2600-9 (1992)  
Target
Name:
Polyunsaturated fatty acid 5-lipoxygenase
Synonyms:
5-LO 5-Lipoxygenase (5-LO) 5-Lipoygenase ALOX5 LOG5 | LOX5_HUMAN
Type:
Enzyme
Mol. Mass.:
77972.74
Organism:
Homo sapiens (Human)
Description:
Recombinant protein was purified from E. coli lysate. After ammonium sulfate precipitation and subsequent steps, the supernatant (S100) was used for 5-LO activity assay.
Residue:
674
  
Inhibitor
Name:
BDBM50000831
Synonyms:
2-{1-Methoxy-1-[3-(3-phenyl-prop-2-ynyloxy)-phenyl]-propyl}-thiazole | CHEMBL327926
Type:
Small organic molecule
Emp. Form.:
C22H21NO2S
Mol. Mass.:
363.473
SMILES:
CCC(OC)(c1nccs1)c1cccc(OCC#Cc2ccccc2)c1
: