Target
Thymidylate synthase
Ligand
BDBM50004372
Substrate
Meas. Tech.
ChEBML_209812
IC50
66±n/a nM
Citation
 Warner, PBarker, AJJackman, ALBurrows, KDRoberts, NBishop, JAO'Connor, BMHughes, LR Quinoline antifolate thymidylate synthase inhibitors: variation of the C2- and C4-substituents. J Med Chem 35:2761-8 (1992)  
Target
Name:
Thymidylate synthase
Synonyms:
TS TYSY_MOUSE | Tyms
Type:
PROTEIN
Mol. Mass.:
34957.15
Organism:
Mus musculus
Description:
ChEMBL_1340097
Residue:
307
  
Inhibitor
Name:
BDBM50004372
Synonyms:
2-{4-[(4-Chloro-2-methyl-quinolin-6-ylmethyl)-prop-2-ynyl-amino]-2-fluoro-benzoylamino}-pentanedioic acid CHEMBL96367
Type:
Small organic molecule
Emp. Form.:
C26H23ClFN3O5
Mol. Mass.:
511.929
SMILES:
Cc1cc(Cl)c2cc(CN(CC#C)c3ccc(C(=O)N[C@@H](CCC(O)=O)C(O)=O)c(F)c3)ccc2n1
: