Target
Thymidylate synthase
Ligand
BDBM50004387
Substrate
Meas. Tech.
ChEBML_209812
IC50
23±n/a nM
Citation
 Warner, PBarker, AJJackman, ALBurrows, KDRoberts, NBishop, JAO'Connor, BMHughes, LR Quinoline antifolate thymidylate synthase inhibitors: variation of the C2- and C4-substituents. J Med Chem 35:2761-8 (1992)  
Target
Name:
Thymidylate synthase
Synonyms:
TS TYSY_MOUSE | Tyms
Type:
PROTEIN
Mol. Mass.:
34957.15
Organism:
Mus musculus
Description:
ChEMBL_1340097
Residue:
307
  
Inhibitor
Name:
BDBM50004387
Synonyms:
2-{4-[(2,4-Dichloro-quinolin-6-ylmethyl)-prop-2-ynyl-amino]-2-fluoro-benzoylamino}-pentanedioic acid ; hydrate | CHEMBL93048
Type:
Small organic molecule
Emp. Form.:
C25H20Cl2FN3O5
Mol. Mass.:
532.348
SMILES:
OC(=O)CC[C@H](NC(=O)c1ccc(cc1F)N(CC#C)Cc1ccc2nc(Cl)cc(Cl)c2c1)C(O)=O
: