Target
Thymidylate synthase
Ligand
BDBM50004392
Substrate
Meas. Tech.
ChEBML_209812
IC50
150±n/a nM
Citation
 Warner, PBarker, AJJackman, ALBurrows, KDRoberts, NBishop, JAO'Connor, BMHughes, LR Quinoline antifolate thymidylate synthase inhibitors: variation of the C2- and C4-substituents. J Med Chem 35:2761-8 (1992)  
Target
Name:
Thymidylate synthase
Synonyms:
TS TYSY_MOUSE | Tyms
Type:
PROTEIN
Mol. Mass.:
34957.15
Organism:
Mus musculus
Description:
ChEMBL_1340097
Residue:
307
  
Inhibitor
Name:
BDBM50004392
Synonyms:
2-{4-[(4-Chloro-2-trifluoromethyl-quinolin-6-ylmethyl)-prop-2-ynyl-amino]-benzoylamino}-pentanedioic acid ; hydrate | CHEMBL96911
Type:
Small organic molecule
Emp. Form.:
C26H21ClF3N3O5
Mol. Mass.:
547.91
SMILES:
OC(=O)CC[C@H](NC(=O)c1ccc(cc1)N(CC#C)Cc1ccc2nc(cc(Cl)c2c1)C(F)(F)F)C(O)=O
: