Target
Thymidylate synthase
Ligand
BDBM50004394
Substrate
Meas. Tech.
ChEBML_209812
IC50
220±n/a nM
Citation
 Warner, PBarker, AJJackman, ALBurrows, KDRoberts, NBishop, JAO'Connor, BMHughes, LR Quinoline antifolate thymidylate synthase inhibitors: variation of the C2- and C4-substituents. J Med Chem 35:2761-8 (1992)  
Target
Name:
Thymidylate synthase
Synonyms:
TS TYSY_MOUSE | Tyms
Type:
PROTEIN
Mol. Mass.:
34957.15
Organism:
Mus musculus
Description:
ChEMBL_1340097
Residue:
307
  
Inhibitor
Name:
BDBM50004394
Synonyms:
2-{4-[(4-Bromo-2-methyl-quinolin-6-ylmethyl)-prop-2-ynyl-amino]-benzoylamino}-pentanedioic acid ; hydrate | CHEMBL330103
Type:
Small organic molecule
Emp. Form.:
C26H24BrN3O5
Mol. Mass.:
538.39
SMILES:
Cc1cc(Br)c2cc(CN(CC#C)c3ccc(cc3)C(=O)N[C@@H](CCC(O)=O)C(O)=O)ccc2n1
: