Target
72 kDa type IV collagenase
Ligand
BDBM50001009
Substrate
Meas. Tech.
ChEBML_49492
IC50
3000±n/a nM
Citation
 Bols, MBinderup, LHansen, JRasmussen, P Inhibition of collagenase by aranciamycin and aranciamycin derivatives. J Med Chem 35:2768-71 (1992)  
Target
Name:
72 kDa type IV collagenase
Synonyms:
72 kDa gelatinase CLG4A Gelatinase A (MMP-2) MMP2_HUMAN Matrix metalloproteinase-2 (MMP 2) Matrix metalloproteinases 2 (MMP-2) | TBE-1
Type:
Enzyme
Mol. Mass.:
73870.36
Organism:
Homo sapiens (Human)
Description:
P08253
Residue:
660
  
Inhibitor
Name:
BDBM50001009
Synonyms:
4-(4,5-Dihydroxy-3-methoxy-6-methyl-tetrahydro-pyran-2-yloxy)-2,5,7-trihydroxy-3-methoxy-2-methyl-3,4-dihydro-2H-naphthacene-1,6,11-trione | CHEMBL92581
Type:
Small organic molecule
Emp. Form.:
C27H28O12
Mol. Mass.:
544.504
SMILES:
COC1C(O)C(O)C(C)OC1O[C@H]1[C@H](OC)[C@@](C)(O)C(=O)c2cc3C(=O)c4cccc(O)c4C(=O)c3c(O)c12
: