Target
72 kDa type IV collagenase
Ligand
BDBM50368351
Substrate
Meas. Tech.
ChEMBL_49492 (CHEMBL662787)
IC50
9900±n/a nM
Citation
 Bols, MBinderup, LHansen, JRasmussen, P Inhibition of collagenase by aranciamycin and aranciamycin derivatives. J Med Chem 35:2768-71 (1992)  
Target
Name:
72 kDa type IV collagenase
Synonyms:
72 kDa gelatinase CLG4A Gelatinase A (MMP-2) MMP2_HUMAN Matrix metalloproteinase-2 (MMP 2) Matrix metalloproteinases 2 (MMP-2) | TBE-1
Type:
Enzyme
Mol. Mass.:
73870.36
Organism:
Homo sapiens (Human)
Description:
P08253
Residue:
660
  
Inhibitor
Name:
BDBM50368351
Synonyms:
ACLACINOMYCIN A | ACLARUBICIN
Type:
Small organic molecule
Emp. Form.:
C42H53NO15
Mol. Mass.:
811.8679
SMILES:
CC[C@@]1(O)C[C@H](O[C@H]2C[C@@H]([C@H](O[C@H]3C[C@H](O)[C@H](O[C@H]4CCC(=O)[C@H](C)O4)[C@H](C)O3)[C@H](C)O2)N(C)C)c2c(O)c3C(=O)c4c(O)cccc4C(=O)c3cc2[C@H]1C(=O)OC
: