Target
72 kDa type IV collagenase
Ligand
BDBM22984
Substrate
Meas. Tech.
ChEBML_49492
IC50
1100±n/a nM
Citation
 Bols, MBinderup, LHansen, JRasmussen, P Inhibition of collagenase by aranciamycin and aranciamycin derivatives. J Med Chem 35:2768-71 (1992)  
Target
Name:
72 kDa type IV collagenase
Synonyms:
72 kDa gelatinase CLG4A Gelatinase A (MMP-2) MMP2_HUMAN Matrix metalloproteinase-2 (MMP 2) Matrix metalloproteinases 2 (MMP-2) | TBE-1
Type:
Enzyme
Mol. Mass.:
73870.36
Organism:
Homo sapiens (Human)
Description:
P08253
Residue:
660
  
Inhibitor
Name:
BDBM22984
Synonyms:
(8S,10S)-10-{[(2R,4S,5S,6S)-4-amino-5-hydroxy-6-methyloxan-2-yl]oxy}-6,8,11-trihydroxy-8-(2-hydroxyacetyl)-1-methoxy-5,7,8,9,10,12-hexahydrotetracene-5,12-dione Adriblastina Doxil | Doxorubicin
Type:
Antibiotic
Emp. Form.:
C27H29NO11
Mol. Mass.:
543.5193
SMILES:
COc1cccc2C(=O)c3c(O)c4C[C@](O)(C[C@H](O[C@H]5C[C@H](N)[C@H](O)[C@H](C)O5)c4c(O)c3C(=O)c12)C(=O)CO
: