Target
Mu-type opioid receptor
Ligand
BDBM50455603
Substrate
Meas. Tech.
ChEBML_146540
Ki
343±n/a nM
Citation
 Carroll, FIAbraham, PParham, KBai, XZhang, XBrine, GAMascarella, SWMartin, BRMay, ELSauss, C Enantiomeric N-substituted N-normetazocines: a comparative study of affinities at sigma, PCP, and mu opioid receptors. J Med Chem 35:2812-8 (1992)  
Target
Name:
Mu-type opioid receptor
Synonyms:
MOR-1 Mu-type opioid receptor (MOR) OPRM_RAT Opioid receptor B Ror-b
Type:
G Protein-Coupled Receptor (GPCR)
Mol. Mass.:
44503.11
Organism:
Rattus norvegicus (rat)
Description:
Competition binding assays were carried out using membrane preparations from transfected HN9.10 cells that constitutively expressed the mu opioid receptor.
Residue:
398
  
Inhibitor
Name:
BDBM50455603
Synonyms:
CHEMBL2368631
Type:
Small organic molecule
Emp. Form.:
C23H30ClNO
Mol. Mass.:
371.943
SMILES:
Cl.[H][C@@]12Cc3ccc(O)cc3[C@](C)(CCN1CCCc1ccccc1)[C@@H]2C
: