Target
Mu-type opioid receptor
Ligand
BDBM50001043
Substrate
Meas. Tech.
ChEBML_146540
Ki
55±n/a nM
Citation
 Carroll, FIAbraham, PParham, KBai, XZhang, XBrine, GAMascarella, SWMartin, BRMay, ELSauss, C Enantiomeric N-substituted N-normetazocines: a comparative study of affinities at sigma, PCP, and mu opioid receptors. J Med Chem 35:2812-8 (1992)  
Target
Name:
Mu-type opioid receptor
Synonyms:
MOR-1 Mu-type opioid receptor (MOR) OPRM_RAT Opioid receptor B Ror-b
Type:
G Protein-Coupled Receptor (GPCR)
Mol. Mass.:
44503.11
Organism:
Rattus norvegicus (rat)
Description:
Competition binding assays were carried out using membrane preparations from transfected HN9.10 cells that constitutively expressed the mu opioid receptor.
Residue:
398
  
Inhibitor
Name:
BDBM50001043
Synonyms:
6,11-Dimethyl-3-phenethyl-1,2,3,4,5,6-hexahydro-2,6-methano-benzo[d]azocin-8-ol | CHEMBL94350
Type:
Small organic molecule
Emp. Form.:
C22H27NO
Mol. Mass.:
321.4559
SMILES:
C[C@@H]1[C@@H]2Cc3ccc(O)cc3[C@]1(C)CCN2CCc1ccccc1
: