Target
Mu-type opioid receptor
Ligand
BDBM50001055
Substrate
Meas. Tech.
ChEMBL_146547 (CHEMBL754966)
Ki
3.3±n/a nM
Citation
 de Costa, BRIadarola, MJRothman, RBBerman, KFGeorge, CNewman, AHMahboubi, AJacobson, AERice, KC Probes for narcotic receptor mediated phenomena. 18. Epimeric 6 alpha- and 6 beta-iodo-3,14-dihydroxy-17-(cyclopropylmethyl)-4,5 alpha-epoxymorphinans as potential ligands for opioid receptor single photon emission computed tomography: synthesis, evaluation, and radiochemistry of [125I]-6 beta-iodo J Med Chem 35:2826-35 (1992)  
Target
Name:
Mu-type opioid receptor
Synonyms:
MOR-1 Mu-type opioid receptor (MOR) OPRM_RAT Opioid receptor B Ror-b
Type:
G Protein-Coupled Receptor (GPCR)
Mol. Mass.:
44503.11
Organism:
Rattus norvegicus (rat)
Description:
Competition binding assays were carried out using membrane preparations from transfected HN9.10 cells that constitutively expressed the mu opioid receptor.
Residue:
398
  
Inhibitor
Name:
BDBM50001055
Synonyms:
4-cyclopropylmethyl-14-fluoro-(13R,14R,17S)-12-oxa-4-azapentacyclo[9.6.1.01,13.05,17.07,18]octadeca-7(18),8,10-triene-10,17-diol(cyclofoxy)
Type:
Small organic molecule
Emp. Form.:
C20H24FNO3
Mol. Mass.:
345.4079
SMILES:
Oc1ccc2CC3N(CC4CC4)CC[C@@]45[C@@H](Oc1c24)[C@H](F)CC[C@@]35O
: