Target
Adenosine receptor A2a
Ligand
BDBM50452520
Substrate
Meas. Tech.
ChEBML_29154
Ki
4.6±1.3 nM
Citation
 Homma, HWatanabe, YAbiru, TMurayama, TNomura, YMatsuda, A Nucleosides and nucleotides. 112. 2-(1-Hexyn-1-yl)adenosine-5'-uronamides: a new entry of selective A2 adenosine receptor agonists with potent antihypertensive activity. J Med Chem 35:2881-90 (1992)  
Target
Name:
Adenosine receptor A2a
Synonyms:
AA2AR_RAT Adenosine A2 receptor Adenosine Receptors A2a (A2a) Adenosine receptors A2a Rat striatal adenosine A2a receptor
Type:
G Protein-Coupled Receptor (GPCR)
Mol. Mass.:
45015.65
Organism:
Rattus norvegicus (rat)
Description:
Rat A2A receptors expressed in CHO cells.
Residue:
410
  
Inhibitor
Name:
BDBM50452520
Synonyms:
CHEMBL2094089 | N6-[2-(3,5-dimethoxyphenyl)-2-(2-methylpheny1)ethyl]adenosine (3, DPMA)
Type:
Small organic molecule
Emp. Form.:
C27H31N5O6
Mol. Mass.:
521.5649
SMILES:
COc1cc(OC)cc(c1)C(CNc1ncnc2n(cnc12)[C@@H]1O[C@H](CO)[C@@H](O)[C@H]1O)c1ccccc1C
: