Target
Adenosine receptor A1
Ligand
BDBM25902
Substrate
Meas. Tech.
ChEBML_29421
Ki
>100000±n/a nM
Citation
 Suzuki, FShimada, JMizumoto, HKarasawa, AKubo, KNonaka, HIshii, AKawakita, T Adenosine A1 antagonists. 2. Structure-activity relationships on diuretic activities and protective effects against acute renal failure. J Med Chem 35:3066-75 (1992)  
Target
Name:
Adenosine receptor A1
Synonyms:
A1 adenosine receptor ADENOSINE A1 ADENOSINE A1 low Adenosine A1 receptor | Adenosine Receptor A1
Type:
Enzyme Catalytic Domain
Mol. Mass.:
36501.39
Organism:
GUINEA PIG
Description:
ADENOSINE A1 ADORA1 GUINEA PIG::P47745
Residue:
326
  
Inhibitor
Name:
BDBM25902
Synonyms:
4-chloro-2-[(furan-2-ylmethyl)amino]-5-sulfamoylbenzoic acid Frusemide Furosemide Furosemide, 4 US10172837, Furosemide
Type:
Small organic molecule
Emp. Form.:
C12H11ClN2O5S
Mol. Mass.:
330.744
SMILES:
NS(=O)(=O)c1cc(C(O)=O)c(NCc2ccco2)cc1Cl
: