Target
Adenosine receptor A1
Ligand
BDBM50004596
Substrate
Meas. Tech.
ChEBML_29421
Ki
1600±n/a nM
Citation
 Suzuki, FShimada, JMizumoto, HKarasawa, AKubo, KNonaka, HIshii, AKawakita, T Adenosine A1 antagonists. 2. Structure-activity relationships on diuretic activities and protective effects against acute renal failure. J Med Chem 35:3066-75 (1992)  
Target
Name:
Adenosine receptor A1
Synonyms:
A1 adenosine receptor ADENOSINE A1 ADENOSINE A1 low Adenosine A1 receptor | Adenosine Receptor A1
Type:
Enzyme Catalytic Domain
Mol. Mass.:
36501.39
Organism:
GUINEA PIG
Description:
ADENOSINE A1 ADORA1 GUINEA PIG::P47745
Residue:
326
  
Inhibitor
Name:
BDBM50004596
Synonyms:
8-Dicyclopropylmethyl-7-ethyl-1,3-dipropyl-3,7-dihydro-purine-2,6-dione | CHEMBL102371
Type:
Small organic molecule
Emp. Form.:
C20H30N4O2
Mol. Mass.:
358.4778
SMILES:
CCCn1c2nc(C(C3CC3)C3CC3)n(CC)c2c(=O)n(CCC)c1=O
: