Target
Adenosine receptor A2a/A2b
Ligand
BDBM50004581
Substrate
Meas. Tech.
ChEMBL_30716 (CHEMBL646483)
Ki
>100000±n/a nM
Citation
 Suzuki, FShimada, JMizumoto, HKarasawa, AKubo, KNonaka, HIshii, AKawakita, T Adenosine A1 antagonists. 2. Structure-activity relationships on diuretic activities and protective effects against acute renal failure. J Med Chem 35:3066-75 (1992)  
Target
Name:
Adenosine receptor A2a/A2b
Synonyms:
Adenosine A2 receptor
Type:
Mol. Mass.:
Description:
ASSAY_ID of ChEMBL is 30560
Components:
This complex has 2 components.
Component 1
Name:
Adenosine receptor A2b
Synonyms:
AA2BR_RAT Adora2b
Type:
PROTEIN
Mol. Mass.:
36378.84
Organism:
Rattus norvegicus
Description:
ChEMBL_32934
Residue:
332
  
Component 2
Name:
Adenosine receptor A2a
Synonyms:
AA2AR_RAT Adenosine A2 receptor Adenosine Receptors A2a (A2a) Adenosine receptors A2a Rat striatal adenosine A2a receptor
Type:
G Protein-Coupled Receptor (GPCR)
Mol. Mass.:
45015.65
Organism:
Rattus norvegicus (rat)
Description:
Rat A2A receptors expressed in CHO cells.
Residue:
410
  
Inhibitor
Name:
BDBM50004581
Synonyms:
8-Dicyclopropylmethyl-3-propyl-3,7-dihydro-purine-2,6-dione | CHEMBL443274
Type:
Small organic molecule
Emp. Form.:
C15H20N4O2
Mol. Mass.:
288.3449
SMILES:
CCCn1c2nc([nH]c2c(=O)[nH]c1=O)C(C1CC1)C1CC1
: