Target
Platelet-activating factor receptor
Ligand
BDBM50004622
Substrate
Meas. Tech.
ChEBML_162882
IC50
0.500000±n/a nM
Citation
 Cooper, KFray, MJParry, MJRichardson, KSteele, J 1,4-Dihydropyridines as antagonists of platelet activating factor. 1. Synthesis and structure-activity relationships of 2-(4-heterocyclyl)phenyl derivatives. J Med Chem 35:3115-29 (1992)  
Target
Name:
Platelet-activating factor receptor
Synonyms:
PAF-R PTAFR_CAVPO Platelet-activating factor receptor
Type:
Protein
Mol. Mass.:
39005.63
Organism:
Cavia porcellus
Description:
Residue:
342
  
Inhibitor
Name:
BDBM50004622
Synonyms:
4-(2-Chloro-phenyl)-2-methyl-6-[4-(2-methyl-imidazo[4,5-c]pyridin-1-yl)-phenyl]-1,4-dihydro-pyridine-3,5-dicarboxylic acid 5-ethyl ester 3-(2-methoxy-ethyl) ester | CHEMBL106908
Type:
Small organic molecule
Emp. Form.:
C32H31ClN4O5
Mol. Mass.:
587.065
SMILES:
CCOC(=O)C1=C(N=C(C)C(C1c1ccccc1Cl)C(=O)OCCOC)c1ccc(cc1)-n1c(C)nc2cnccc12
: