Target
Polyunsaturated fatty acid 5-lipoxygenase
Ligand
BDBM50001181
Substrate
Meas. Tech.
ChEBML_98492
EC50
39±n/a nM
Citation
 Greco, MNHageman, WEPowell, ETTighe, JJPersico, FJ Benzothiazole hydroxy ureas as inhibitors of 5-lipoxygenase: use of the hydroxyurea moiety as a replacement for hydroxamic acid. J Med Chem 35:3180-3 (1992)  
Target
Name:
Polyunsaturated fatty acid 5-lipoxygenase
Synonyms:
5-LO 5-Lipoxygenase (5-LO) 5-Lipoygenase ALOX5 LOG5 | LOX5_HUMAN
Type:
Enzyme
Mol. Mass.:
77972.74
Organism:
Homo sapiens (Human)
Description:
Recombinant protein was purified from E. coli lysate. After ammonium sulfate precipitation and subsequent steps, the supernatant (S100) was used for 5-LO activity assay.
Residue:
674
  
Inhibitor
Name:
BDBM50001181
Synonyms:
3-(Benzothiazol-2-ylsulfanyl)-N-hydroxy-N-methyl-propionamide | CHEMBL108204
Type:
Small organic molecule
Emp. Form.:
C11H12N2O2S2
Mol. Mass.:
268.355
SMILES:
CN(O)C(=O)CCSc1nc2ccccc2s1
: