Target
Glutamate receptor ionotropic, NMDA 1
Ligand
BDBM50002707
Substrate
Meas. Tech.
ChEBML_140542
Ki
630±n/a nM
Citation
 McQuaid, LASmith, ECSouth, KKMitch, CHSchoepp, DDTrue, RACalligaro, DOO'Malley, PJLodge, DOrnstein, PL Synthesis and excitatory amino acid pharmacology of a series of heterocyclic-fused quinoxalinones and quinazolinones. J Med Chem 35:3319-24 (1992)  
Target
Name:
Glutamate receptor ionotropic, NMDA 1
Synonyms:
Glutamate (NMDA) receptor subunit zeta 1 Glutamate-NMDA-Channel Glutamate-NMDA-Polyamine NMDA Nmdar1 | phencyclidine
Type:
Enzyme Catalytic Domain
Mol. Mass.:
105533.40
Organism:
RAT
Description:
P35439
Residue:
938
  
Inhibitor
Name:
BDBM50002707
Synonyms:
7,8-Dichloro-5H-[1,2,4]triazolo[4,3-a]quinoxalin-4-one | CHEMBL112386
Type:
Small organic molecule
Emp. Form.:
C9H4Cl2N4O
Mol. Mass.:
255.06
SMILES:
Clc1cc2[nH]c(=O)c3nncn3c2cc1Cl
: