Target
Glutamate receptor ionotropic, NMDA 1
Ligand
BDBM50002709
Substrate
Meas. Tech.
ChEBML_140542
Ki
>10000±n/a nM
Citation
 McQuaid, LASmith, ECSouth, KKMitch, CHSchoepp, DDTrue, RACalligaro, DOO'Malley, PJLodge, DOrnstein, PL Synthesis and excitatory amino acid pharmacology of a series of heterocyclic-fused quinoxalinones and quinazolinones. J Med Chem 35:3319-24 (1992)  
Target
Name:
Glutamate receptor ionotropic, NMDA 1
Synonyms:
Glutamate (NMDA) receptor subunit zeta 1 Glutamate-NMDA-Channel Glutamate-NMDA-Polyamine NMDA Nmdar1 | phencyclidine
Type:
Enzyme Catalytic Domain
Mol. Mass.:
105533.40
Organism:
RAT
Description:
P35439
Residue:
938
  
Inhibitor
Name:
BDBM50002709
Synonyms:
8,9-Dichloro-6H-pyrazolo[1,5-c]quinazolin-5-one | CHEMBL113107
Type:
Small organic molecule
Emp. Form.:
C10H5Cl2N3O
Mol. Mass.:
254.072
SMILES:
Clc1cc2[nH]c(=O)n3nccc3c2cc1Cl
: