Target
Glutamate receptor ionotropic, NMDA 1
Ligand
BDBM50002704
Substrate
Meas. Tech.
ChEBML_140542
Ki
7350±n/a nM
Citation
 McQuaid, LASmith, ECSouth, KKMitch, CHSchoepp, DDTrue, RACalligaro, DOO'Malley, PJLodge, DOrnstein, PL Synthesis and excitatory amino acid pharmacology of a series of heterocyclic-fused quinoxalinones and quinazolinones. J Med Chem 35:3319-24 (1992)  
Target
Name:
Glutamate receptor ionotropic, NMDA 1
Synonyms:
Glutamate (NMDA) receptor subunit zeta 1 Glutamate-NMDA-Channel Glutamate-NMDA-Polyamine NMDA Nmdar1 | phencyclidine
Type:
Enzyme Catalytic Domain
Mol. Mass.:
105533.40
Organism:
RAT
Description:
P35439
Residue:
938
  
Inhibitor
Name:
BDBM50002704
Synonyms:
7-Nitro-5H-[1,2,4]triazolo[4,3-a]quinoxalin-4-one | CHEMBL321171
Type:
Small organic molecule
Emp. Form.:
C9H5N5O3
Mol. Mass.:
231.1677
SMILES:
[O-][N+](=O)c1ccc2c(c1)[nH]c(=O)c1nncn21
: