Target
Prothrombin
Ligand
BDBM50368383
Substrate
Meas. Tech.
ChEBML_208493
Ki
13500±n/a nM
Citation
 Cheng, LGoodwin, CASchully, MFKakkar, VVClaeson, G Synthesis and biological activity of ketomethylene pseudopeptide analogues as thrombin inhibitors. J Med Chem 35:3364-9 (1992)  
Target
Name:
Prothrombin
Synonyms:
Activation peptide fragment 1 Coagulation factor II Prothrombin precursor Thrombin heavy chain | Thrombin light chain
Type:
Protein
Mol. Mass.:
70029.57
Organism:
Homo sapiens (Human)
Description:
P00734
Residue:
622
  
Inhibitor
Name:
BDBM50368383
Synonyms:
CHEMBL1202121
Type:
Small organic molecule
Emp. Form.:
C32H45N7O4
Mol. Mass.:
591.7442
SMILES:
[#7]-[#6](-[#6]-c1cccc2ccccc12)-[#6](=O)-[#7]-1-[#6]-[#6]-[#6]-[#6@H]-1-[#6](=O)-[#7]-[#6](-[#6]-[#6]-[#6]\[#7]=[#6](\[#7])-[#7])-[#6](=O)-[#6]-[#6]-[#6](=O)-[#7]-1-[#6]-[#6]-[#6]-[#6]-[#6]-1
: