Target
Prothrombin
Ligand
BDBM50004771
Substrate
Meas. Tech.
ChEBML_208493
Ki
1300±n/a nM
Citation
 Cheng, LGoodwin, CASchully, MFKakkar, VVClaeson, G Synthesis and biological activity of ketomethylene pseudopeptide analogues as thrombin inhibitors. J Med Chem 35:3364-9 (1992)  
Target
Name:
Prothrombin
Synonyms:
Activation peptide fragment 1 Coagulation factor II Prothrombin precursor Thrombin heavy chain | Thrombin light chain
Type:
Protein
Mol. Mass.:
70029.57
Organism:
Homo sapiens (Human)
Description:
P00734
Residue:
622
  
Inhibitor
Name:
BDBM50004771
Synonyms:
1-(2-Amino-3-phenyl-propionyl)-pyrrolidine-2-carboxylic acid [1-(3-guanidino-propyl)-2,5-dioxo-5-piperidin-1-yl-pentyl]-amide | CHEMBL115829
Type:
Small organic molecule
Emp. Form.:
C28H43N7O4
Mol. Mass.:
541.6855
SMILES:
N[C@H](Cc1ccccc1)C(=O)N1CCC[C@H]1C(=O)NC(CCCNC(N)=N)C(=O)CCC(=O)N1CCCCC1
: