Target
3-hydroxy-3-methylglutaryl-coenzyme A reductase
Ligand
BDBM50455629
Substrate
Meas. Tech.
ChEBML_78177
IC50
3±n/a nM
Citation
 Bone, EADavidson, AHLewis, CNTodd, RS Synthesis and biological evaluation of dihydroeptastatin, a novel inhibitor of 3-hydroxy-3-methylglutaryl coenzyme A reductase. J Med Chem 35:3388-93 (1992)  
Target
Name:
3-hydroxy-3-methylglutaryl-coenzyme A reductase
Synonyms:
HMDH_RAT Hmgcr
Type:
Enzyme
Mol. Mass.:
96689.85
Organism:
Rattus norvegicus (rat)
Description:
Isolated rat liver microsomes were used as enzyme source.
Residue:
887
  
Inhibitor
Name:
BDBM50455629
Synonyms:
CHEMBL487720
Type:
Small organic molecule
Emp. Form.:
C25H39NaO6
Mol. Mass.:
458.5633
SMILES:
[Na+].[H][C@@](O)(CC[C@@]1([H])[C@@H](C)C=CC2=C[C@H](C)C[C@H](OC(=O)C(C)(C)CC)[C@]12[H])C[C@@H](O)CC([O-])=O
: