Target
Potassium-transporting ATPase alpha chain 1/subunit beta
Ligand
BDBM50001236
Substrate
Meas. Tech.
ChEMBL_29665 (CHEMBL875664)
IC50
4800±n/a nM
Citation
 Ife, RJBrown, THKeeling, DJLeach, CAMeeson, MLParsons, MEReavill, DRTheobald, CJWiggall, KJ Reversible inhibitors of the gastric (H+/K+)-ATPase. 3. 3-substituted-4-(phenylamino)quinolines. J Med Chem 35:3413-22 (1992)  
Target
Name:
Potassium-transporting ATPase alpha chain 1/subunit beta
Synonyms:
Potassium-transporting ATPase | Potassium-transporting ATPase alpha chain 1/beta chain
Type:
Mol. Mass.:
Description:
Components:
This complex has 0 components.
Component 1
Name:
Potassium-transporting ATPase subunit beta
Synonyms:
ATP4B Gastric H(+)/K(+) ATPase subunit beta Potassium-transporting ATPase beta chain Proton pump beta chain | gp60-90
Type:
Mol. Mass.:
33083.09
Organism:
Sus scrofa (Pig)
Description:
Residue:
290
  
Component 2
Name:
Potassium-transporting ATPase alpha chain 1
Synonyms:
ATP4A Gastric H(+)/K(+) ATPase subunit alpha Na/K-ATPase Potassium-transporting ATPase alpha chain 1 | Proton pump
Type:
Enzyme
Mol. Mass.:
114279.23
Organism:
Sus scrofa (Pig)
Description:
P19156
Residue:
1034
  
Inhibitor
Name:
BDBM50001236
Synonyms:
1-(8-Methoxy-4-o-tolylamino-quinolin-3-yl)-ethanone | CHEMBL114827
Type:
Small organic molecule
Emp. Form.:
C19H18N2O2
Mol. Mass.:
306.3584
SMILES:
COc1cccc2c(Nc3ccccc3C)c(cnc12)C(C)=O
: